autopkgtest regression with openssl 3

I raised the issue to the upstream developer, and he is working on it:
https://github.com/grke/burp/issues/904

He is very responsive and gentle.


On Tue, 24 May 2022 20:53:39 +0200 Sebastian Ramacher
<sramac...@debian.org> wrote:

> Source: burp
> Version: 2.4.0-3
> Severity: serious
> Tags: sid bookworm
>
> burp's autopkgtest fail with openssl 3:
>

> make[2]: Entering directory
'/tmp/autopkgtest-lxc.lg0p9u2a/downtmp/build.c19/src'

> FAIL: runner

>
============================================================================

> Testsuite summary for Burp 2.4.0

>
============================================================================

> # TOTAL: 1
> # PASS: 0
> # SKIP: 0
> # XFAIL: 0
> # FAIL: 1
> # XPASS: 0
> # ERROR: 0

>
============================================================================

> See ./test-suite.log
> Please report to https://github.com/grke/burp/issues

>
============================================================================

> make[2]: *** [Makefile:8640: test-suite.log] Error 1

> make[2]: Leaving directory
'/tmp/autopkgtest-lxc.lg0p9u2a/downtmp/build.c19/src'

> make[1]: *** [Makefile:8748: check-TESTS] Error 2

> make[1]: Leaving directory
'/tmp/autopkgtest-lxc.lg0p9u2a/downtmp/build.c19/src'

> make: *** [Makefile:8959: check-am] Error 2
> autopkgtest [09:14:37]: test burp-unit-test: -----------------------]
>
>
> See

>
ci.debian.net/data/autopkgtest/testing/amd64/b/burp/22058117/log.gz

>
> Cheers
> --
> Sebastian Ramacher
>
>

Read more here: Source link